{"text_format":"3","workbook":"xlsx","n_sheets":3,"sheets":["公示信息","Sheet1","Sheet3"],"not_rendered":{"images":1,"external_links":1,"defined_names":2},"read":"whole","date_system":"1900"}

{"sheet":"公示信息","index":0,"n_rows":35,"n_cols":16,"rows_kept":35}
["序号","性质","课程类型","选课序号","课程名称","录用学生","申请学号","学分","教师","职称","选课人数","上课时间","教室","标准岗位数","岗位工作职责要求"]
[45,"校聘","本科生","MATH120044.03","线性代数","张帅",12210680258,"3.0","朱弘鑫","副教授","105","一1-2；三1-2","H6301",1,"①随堂听课；②批改课后作业；③答疑；⑤监考"]
[43,"校聘","本科生","ECON130167.01","保险公司财务管理","陈卓苗",12210680083,"2.0","许闲","讲师","42","一 3-4","H6302",0.5,"①随堂听课；②批改课后作业；③答疑；④制作课程PPT；⑤监考；⑥其它"]
[37,"校聘","本科生","ECON130097.01","保险会计学","张涵博",12210680109,"2.0","许闲","讲师","42","一 1-2","H6302",0.5,"①随堂听课；②批改课后作业；③答疑；④制作课程PPT；⑤监考；⑥其它"]
[36,"院聘","本科生","ECON130080.02","投资银行理论与实证分析","黄菀薇",12210680085,"3.0","罗忠洲","副教授",60,"一 2-4",null,0.5,"①随堂听课；②批改课后作业；③答疑；④制作课程PPT；⑤监考；⑥其它"]
[35,"校聘","本科生","ECON130064.01","博弈论","王璐瑜",12210680039,"3.0","朱弘鑫","副教授","90","三 6-8","H6509",0.5,"①随堂听课；②批改课后作业；③答疑；⑤监考"]
[34,"校聘","本科生","ECON130063.01","国际营销学","张菡",12210680042,"3.0","何喜有","副教授","70","四 2-4","H6207",0.5,"①随堂听课；②批改课后作业；③答疑；④制作课程PPT；⑤监考；⑥其它"]
[32,"校聘","本科生","ECON130031.02","投资学原理","方晋之",12210680028,"3.0","郑辉","副教授","110","二 2-4","H6101",0.5,"①随堂听课；②批改课后作业；③答疑；④制作课程PPT；⑤监考；⑥其它"]
[31,"校聘","本科生","ECON130031.01","投资学原理","王爽",12110680042,"3.0","张宗新","教授","93","四 2-4","H6506",0.5,"①随堂听课；②批改课后作业；③答疑；④制作课程PPT；⑤监考；⑥其它"]
[30,"校聘","本科生","ECON130021.01","比较经济学","滕君",11210680180,"3.0","李维森","教授","90","四 6-8","H6106",0.5,"①随堂听课；②批改课后作业；③答疑；④制作课程PPT；⑤监考；⑥其它"]
[25,"校聘","本科生","ECON130006.02","计量经济学","张倩云",12210680043,"3.0","谢识予","教授","90","二 2-4","H6106","0.5-1","①随堂听课；②批改课后作业；③答疑；④制作课程PPT；⑤监考；⑥其它"]
[22,"校聘","本科生","ECON130005.02","财政学","黄云飞",11210680152,"3.0","唐朱昌","教授","70","三 2-4","H6106",0.5,"①随堂听课；②批改课后作业；③答疑；④制作课程PPT；⑤监考；⑥其它"]
[16,"校聘","本科生","ECON120015.02","会计学","尹伊",12210680286,"3.0","徐晔","高级讲师","70","二3-4；五3-4","H6105",1,"①随堂听课；②批改课后作业；③答疑；④制作课程PPT；⑤监考；⑥其它"]
[15,"校聘","本科生","ECON120015.01","会计学","吉理",11210680077,"3.0","焦必方","教授","95","二3-4；五3-4","H6506",1,"①随堂听课；②批改课后作业；③答疑；④制作课程PPT；⑤监考；⑥其它"]
[8,"校聘","本科生","ECON120003.02","宏观经济学A","饶璨",12110680015,"3.0","袁志刚","教授","110","三 6-8","H6112",0.5,"①随堂听课；②批改课后作业；③答疑；④制作课程PPT；⑤监考；⑥其它"]
[6,"校聘","本科生","ECON120001.06","政治经济学","黄尚进",11210680003,"3.0","高帆","副教授","110","四 2-4","H6312",0.5,"①随堂听课；②批改课后作业；③答疑；⑤监考；"]
[3,"校聘","本科生","ECON120001.03","政治经济学","李畅",12210680088,"3.0","严法善","教授","110","四 2-4","H6112",0.5,"①随堂听课；②批改课后作业；③答疑；④制作课程PPT；⑤监考；⑥其它"]
[40,"校聘","本科生","ECON110017.01","证券投资理论与实证分析","刘畅",12210680227,"3.0","罗忠洲","副教授",60,"一 11-12",null,0.5,"①随堂听课；②批改课后作业；③答疑；④制作课程PPT；⑤监考；⑥其它"]
[53,"院聘","二专","969.001.1.01","会计学","朱敏",12210680291,"3.0","焦必方","教授","120","四 11-13","H4201",0.5,"①随堂听课；②批改课后作业；③答疑；④制作课程PPT；⑤监考；⑥其它"]
[50,"院聘","二专","968.034.1.02","国际金融","刘洋",12210680032,"3.0","郑辉","副教授","90","二 11-13","H4104",0.5,"①随堂听课；②批改课后作业；③答疑；④制作课程PPT；⑤监考；⑥其它",""]
[48,"院聘","二专","968.033.1.02","概率论与数理统计","孙昭然",12210680128,"3.0","朱弘鑫","副教授","60","一 11-13","H6104",0.5,"①随堂听课；②批改课后作业；③答疑；⑤监考"]
[46,"院聘","二专","968.029.1.01","统计学","陆燕婷",10210680084,"3.0","李洁明","教授","110","三 11-13","H4301",0.5,"①随堂听课；②批改课后作业；③答疑；④制作课程PPT；⑤监考；⑥其它"]
[55,"院聘","二专","968.025.1.01","国际经营","马晋",12210680033,"3.0","强永昌","教授","90","三 11-13","H4104"]
[56,"院聘","跨校辅修",null,"微观经济学","程佳丽",12210680127,"3.0","常中阳","讲师","待定","周六12:30-15:00","H3409",0.5,"①随堂听课；②批改课后作业；③答疑；④制作课程PPT；⑤监考；⑥其它"]
[85,"院聘","跨校辅修",null,"国际贸易","李金柳",12210680089,null,"胡涵均"]
[62,"院聘","跨校辅修",null,"会计学","杨丽莉",12210680285,"3.0","徐晔","高级讲师","待定","周六8:30——11:00",null,0.5,"①批改课后作业；②答疑；③制作课程PPT；④监考；⑤其它"]
[67,"院聘","硕博连读","ECON620043","计量经济学（二）——时间序列分析","汪莉",12110680041,"3.0","蒋碧波","讲师",null,"1-19周,星期五第2-4节","H6306",0.5,"①随堂听课；②批改课后作业；③答疑；④制作课程PPT；⑤监考；⑥其它"]
[66,"院聘","硕博连读","ECON6142","数理经济学","周强龙",11210680134,"2.0","蒋碧波、康明怡","讲师",null,"1-19周,星期五第6-8节","H6305",0.5,"①随堂听课；②批改课后作业；③答疑；④制作课程PPT；⑤监考；⑥其它"]
[81,"院聘","研究生","MAST612106","专业英语","杨皓伃",11210680300,"3.0","罗汉","副教授",160,"周一 13:30-15:10","H6206",0.5,"①批改课后作业；②制作课程PPT；③监考"]
[80,"院聘","研究生","ECON8021","博士高级计量经济学","刘芳",12110680009,"3.0","陈诗一","教授",null,"周五 2-4","H6508",0.5,"①随堂听课；②批改课后作业；③答疑；④制作课程PPT；⑤监考；⑥其它"]
[78,"院聘","研究生","ECON7186","转型经济学","唐为",12110680019,"2.0","刘军梅","副教授",null,"周一 11-12","H2105B",0.5,"①随堂听课；②批改课后作业；③答疑；④制作课程PPT；⑤监考；⑥其它"]
[83,"院聘","研究生","ECON7147","衍生金融工具(专硕）","王全",11210680186,"2.0","蒋祥林","副研究员",50,"一 3-4","H6208",0.5,"①随堂听课；②批改课后作业；③答疑；④监考；"]
[77,"院聘","研究生","ECON620061","证券投资分析（专硕）","邱虹宇",10210680158,"3.0","罗忠洲","副教授",60,"周二 1-2","H6208",0.5,"①随堂听课；②批改课后作业；③答疑；④制作课程PPT；⑤监考；⑥其它"]
[72,"院聘","研究生","ECON6018","世界经济专题研究","霍明",10110680024,"3.0","唐朱昌","教授",null,"周二 2-4","H2113B",0.5,"①随堂听课；②批改课后作业；③答疑；④制作课程PPT；⑤监考；⑥其它"]
[71,"院聘","研究生","ECON6006","政治经济学","郭杰振",12110680003,"3.0","严法善","教授",null,"周三 11-13","H3408",0.5,"①随堂听课；②批改课后作业；③答疑；④制作课程PPT；⑤监考；⑥其它"]

{"sheet":"Sheet1","index":1,"n_rows":58,"n_cols":2,"rows_kept":58}
["姓名"]
["常中阳",{"$f":"VLOOKUP(A2,[1]Sheet1!$C$2:$D$141,2,FALSE)","v":"czytd@126.com,"}]
["陈学彬",{"$f":"VLOOKUP(A3,[1]Sheet1!$C$2:$D$141,2,FALSE)","v":"czytd@126.com,"}]
["杜莉",{"$f":"VLOOKUP(A4,[1]Sheet1!$C$2:$D$141,2,FALSE)","v":"czytd@126.com,"}]
["樊潇彦",{"$f":"VLOOKUP(A5,[1]Sheet1!$C$2:$D$141,2,FALSE)","v":"czytd@126.com,"}]
["樊潇彦",{"$f":"VLOOKUP(A6,[1]Sheet1!$C$2:$D$141,2,FALSE)","v":"czytd@126.com,"}]
["范剑勇",{"$f":"VLOOKUP(A7,[1]Sheet1!$C$2:$D$141,2,FALSE)","v":"czytd@126.com,"}]
["冯剑亮",{"$f":"VLOOKUP(A8,[1]Sheet1!$C$2:$D$141,2,FALSE)","v":"czytd@126.com,"}]
["冯剑亮",{"$f":"VLOOKUP(A9,[1]Sheet1!$C$2:$D$141,2,FALSE)","v":"czytd@126.com,"}]
["冯剑亮",{"$f":"VLOOKUP(A10,[1]Sheet1!$C$2:$D$141,2,FALSE)","v":"czytd@126.com,"}]
["高帆",{"$f":"VLOOKUP(A11,[1]Sheet1!$C$2:$D$141,2,FALSE)","v":"czytd@126.com,"}]
["何喜有",{"$f":"VLOOKUP(A12,[1]Sheet1!$C$2:$D$141,2,FALSE)","v":"czytd@126.com,"}]
["胡涵均",{"$f":"VLOOKUP(A13,[1]Sheet1!$C$2:$D$141,2,FALSE)","v":"czytd@126.com,"}]
["华民",{"$f":"VLOOKUP(A14,[1]Sheet1!$C$2:$D$141,2,FALSE)","v":"czytd@126.com,"}]
["黄亚钧",{"$f":"VLOOKUP(A15,[1]Sheet1!$C$2:$D$141,2,FALSE)","v":"czytd@126.com,"}]
["蒋碧波",{"$f":"VLOOKUP(A16,[1]Sheet1!$C$2:$D$141,2,FALSE)","v":"czytd@126.com,"}]
["蒋碧波、康明怡",{"$f":"VLOOKUP(A17,[1]Sheet1!$C$2:$D$141,2,FALSE)","v":"czytd@126.com,"}]
["蒋祥林",{"$f":"VLOOKUP(A18,[1]Sheet1!$C$2:$D$141,2,FALSE)","v":"czytd@126.com,"}]
["蒋祥林",{"$f":"VLOOKUP(A19,[1]Sheet1!$C$2:$D$141,2,FALSE)","v":"czytd@126.com,"}]
["焦必方",{"$f":"VLOOKUP(A20,[1]Sheet1!$C$2:$D$141,2,FALSE)","v":"czytd@126.com,"}]
["焦必方",{"$f":"VLOOKUP(A21,[1]Sheet1!$C$2:$D$141,2,FALSE)","v":"czytd@126.com,"}]
["康明怡",{"$f":"VLOOKUP(A22,[1]Sheet1!$C$2:$D$141,2,FALSE)","v":"czytd@126.com,"}]
["李洁明",{"$f":"VLOOKUP(A23,[1]Sheet1!$C$2:$D$141,2,FALSE)","v":"czytd@126.com,"}]
["李维森",{"$f":"VLOOKUP(A24,[1]Sheet1!$C$2:$D$141,2,FALSE)","v":"czytd@126.com,"}]
["刘军梅",{"$f":"VLOOKUP(A25,[1]Sheet1!$C$2:$D$141,2,FALSE)","v":"czytd@126.com,"}]
["罗汉",{"$f":"VLOOKUP(A26,[1]Sheet1!$C$2:$D$141,2,FALSE)","v":"czytd@126.com,"}]
["罗汉",{"$f":"VLOOKUP(A27,[1]Sheet1!$C$2:$D$141,2,FALSE)","v":"czytd@126.com,"}]
["罗忠洲",{"$f":"VLOOKUP(A28,[1]Sheet1!$C$2:$D$141,2,FALSE)","v":"czytd@126.com,"}]
["罗忠洲",{"$f":"VLOOKUP(A29,[1]Sheet1!$C$2:$D$141,2,FALSE)","v":"czytd@126.com,"}]
["牛晓健",{"$f":"VLOOKUP(A30,[1]Sheet1!$C$2:$D$141,2,FALSE)","v":"czytd@126.com,"}]
["潘佳",{"$f":"VLOOKUP(A31,[1]Sheet1!$C$2:$D$141,2,FALSE)","v":"czytd@126.com,"}]
["攀登",{"$f":"VLOOKUP(A32,[1]Sheet1!$C$2:$D$141,2,FALSE)","v":"czytd@126.com,"}]
["石磊",{"$f":"VLOOKUP(A33,[1]Sheet1!$C$2:$D$141,2,FALSE)","v":"czytd@126.com,"}]
["孙大权",{"$f":"VLOOKUP(A34,[1]Sheet1!$C$2:$D$141,2,FALSE)","v":"czytd@126.com,"}]
["孙大权",{"$f":"VLOOKUP(A35,[1]Sheet1!$C$2:$D$141,2,FALSE)","v":"czytd@126.com,"}]
["唐朱昌",{"$f":"VLOOKUP(A36,[1]Sheet1!$C$2:$D$141,2,FALSE)","v":"czytd@126.com,"}]
["唐朱昌",{"$f":"VLOOKUP(A37,[1]Sheet1!$C$2:$D$141,2,FALSE)","v":"czytd@126.com,"}]
["田素华",{"$f":"VLOOKUP(A38,[1]Sheet1!$C$2:$D$141,2,FALSE)","v":"czytd@126.com,"}]
["田素华",{"$f":"VLOOKUP(A39,[1]Sheet1!$C$2:$D$141,2,FALSE)","v":"czytd@126.com,"}]
["王永钦",{"$f":"VLOOKUP(A40,[1]Sheet1!$C$2:$D$141,2,FALSE)","v":"czytd@126.com,"}]
["吴建峰",{"$f":"VLOOKUP(A41,[1]Sheet1!$C$2:$D$141,2,FALSE)","v":"czytd@126.com,"}]
["谢识予",{"$f":"VLOOKUP(A42,[1]Sheet1!$C$2:$D$141,2,FALSE)","v":"czytd@126.com,"}]
["徐筱凤",{"$f":"VLOOKUP(A43,[1]Sheet1!$C$2:$D$141,2,FALSE)","v":"czytd@126.com,"}]
["徐晔",{"$f":"VLOOKUP(A44,[1]Sheet1!$C$2:$D$141,2,FALSE)","v":"czytd@126.com,"}]
["徐晔",{"$f":"VLOOKUP(A45,[1]Sheet1!$C$2:$D$141,2,FALSE)","v":"czytd@126.com,"}]
["许闲",{"$f":"VLOOKUP(A46,[1]Sheet1!$C$2:$D$141,2,FALSE)","v":"czytd@126.com,"}]
["许闲",{"$f":"VLOOKUP(A47,[1]Sheet1!$C$2:$D$141,2,FALSE)","v":"czytd@126.com,"}]
["严法善",{"$f":"VLOOKUP(A48,[1]Sheet1!$C$2:$D$141,2,FALSE)","v":"czytd@126.com,"}]
["严法善",{"$f":"VLOOKUP(A49,[1]Sheet1!$C$2:$D$141,2,FALSE)","v":"czytd@126.com,"}]
["余显财",{"$f":"VLOOKUP(A50,[1]Sheet1!$C$2:$D$141,2,FALSE)","v":"czytd@126.com,"}]
["张涛",{"$f":"VLOOKUP(A51,[1]Sheet1!$C$2:$D$141,2,FALSE)","v":"czytd@126.com,"}]
["张涛",{"$f":"VLOOKUP(A52,[1]Sheet1!$C$2:$D$141,2,FALSE)","v":"czytd@126.com,"}]
["张卫平",{"$f":"VLOOKUP(A53,[1]Sheet1!$C$2:$D$141,2,FALSE)","v":"czytd@126.com,"}]
["张宗新",{"$f":"VLOOKUP(A54,[1]Sheet1!$C$2:$D$141,2,FALSE)","v":"czytd@126.com,"}]
["郑辉",{"$f":"VLOOKUP(A55,[1]Sheet1!$C$2:$D$141,2,FALSE)","v":"czytd@126.com,"}]
["郑辉",{"$f":"VLOOKUP(A56,[1]Sheet1!$C$2:$D$141,2,FALSE)","v":"czytd@126.com,"}]
["朱弘鑫",{"$f":"VLOOKUP(A57,[1]Sheet1!$C$2:$D$141,2,FALSE)","v":"czytd@126.com,"}]
["朱弘鑫",{"$f":"VLOOKUP(A58,[1]Sheet1!$C$2:$D$141,2,FALSE)","v":"czytd@126.com,"}]

{"sheet":"Sheet3","index":2,"n_rows":36,"n_cols":16,"rows_kept":36}
["序号","性质","课程类型","选课序号","课程名称","申请方式","学分","教师","电子邮件地址","职称","选课人数","上课时间","教室","标准岗位数","岗位工作职责要求","其他要求"]
[4,"校聘","本科生","ECON120001.04","政治经济学",null,"3.0","朱强","zhuqiang884@sohu.com","副教授","110","四 2-4","H6401"]
[9,"校聘","本科生","MATH120044.04","线性代数",null,"3.0","陈琳娜",{"$error":"#N/A"},"","70","一1-2；三1-2","H6104"]
[13,"校聘","本科生","ECON130140.01","中国金融史",null,"2.0","张徐乐","zhxule@fudan.edu.cn","副研究员","70","四 3-4","H6105"]
[15,"校聘","本科生","ECON120003.01","宏观经济学A",null,"3.0","黄亚钧","yajunhuang@fudan.edu.cn","教授","60","三 6-8","H6104"]
[20,"校聘","本科生","ECON120003.06","宏观经济学A",null,"3.0","程向前","xq-cheng@fudan.edu.cn","高级讲师","50","三 6-8","H6106"]
[32,"校聘","本科生","ECON130173.01","反洗钱与金融犯罪",null,"2.0","严立新","lxyan@fudan.edu.cn","助理研究员","70","一 6-7","H6105"]
[33,"校聘","本科生","ECON130061.01","国别和地区经济",null,"3.0","袁堂军","e1103@hotmail.com","副研究员","70","一 6-8","H6104"]
[34,"校聘","本科生","ECON130090.01","金融经济学",null,"2.0","姚京","jyao.cn@gmail.com","助理研究员","70","二 6-7","H6404"]
[37,"校聘","本科生","ECON130062.01","国际贸易实务",null,"3.0","蔡晓月","caixiaoyue@fudan.edu.cn","讲师","70","五 2-4","H6404"]
[38,"校聘","本科生","ECON130087.01","兼并和收购",null,"2.0","杨青","qyang@fudan.edu.cn","副教授","70","五 6-7","H6104"]
[39,"校聘","本科生","ECON130171.01","经济学论文写作",null,"2.0","罗汉","luohan@fudan.edu.cn","副教授","60","一 3-4","H6105"]
[40,"校聘","本科生","ECON130141.01","信息经济学",null,"2.0","陈钊","zhaochen@fudan.edu.cn","教授","128","三 3-4","H6112"]
[45,"校聘","本科生","ECON130057.01","农村和农业经济学",null,"2.0","焦必方","jiaobifa@sh163.net","教授","100","一 6-7","H6101"]
[46,"校聘","本科生","ECON130072.01","国际金融管理",null,"3.0","朱叶","pyjib@online.sh.cn","教授","90","三 2-4","H6108",null,null,"办公室：420"]
[48,"校聘","本科生","ECON130007.03","货币银行学",null,"3.0","田素华","tiansuhua@fudan.edu.cn","教授","90","四 2-4","H6509"]
[49,"校聘","本科生","ECON130059.01","城市经济学",null,"3.0","周伟林","zwl@midway.com.cn","副教授","70","二 2-4","H6104"]
[51,"校聘","本科生","ECON130056.01","区域经济学",null,"2.0","范剑勇","jyfan0393@163.com ","教授","70","四 3-4","H6307"]
[53,"校聘","本科生","ECON130155.01","宏观财政政策分析",null,"2.0","王殿志","lvhuow@sina.com","讲师","54","四 3-4","H6404",null,null,"助教：管泉森"]
[55,"校聘","本科生","ECON130103.01","保险企业经营管理",null,"2.0","沈婷","shentingshanghai@163.com","讲师","103","二 8-9","H6101",null,null,"助教：王云骢"]
[58,"院聘","本科生","ECON110024.01","国际金融",null,"3.0","Francisco Lopez Medina",{"$error":"#N/A"},"","100","一 6-8(1-15周)","H6201"]
[59,"院聘","本科生","ECON120006.01","公共经济与社会保障",null,"2.0","封进","jfeng@fudan.edu.cn","教授","70","一 11-12","H4303"]
[60,"院聘","本科生","ECON110015.01","外国经济思潮",null,"2.0","方钦","errantking@gmail.com","讲师","70","一 11-12","H6105",null,null,"推荐：王茜"]
[61,"院聘","本科生","ECON110011.01","人口、资源、环境与经济发展",null,"2.0","戚顺荣","qixx0012@yahoo.com.cn","副教授","70","二 11-12","H6104"]
[62,"院聘","本科生","ECON110016.01","信息化与网络金融",null,"2.0","杨青","qyang@fudan.edu.cn","副教授","70","二 11-12","H6105"]
[63,"院聘","本科生","ECON130012.01","发展经济学",null,"3.0","尹翔硕","xshyin@fudan.edu.cn","教授","50","三 1-4(1-15周)","HGX105"]
[64,"院聘","本科生","ECON120010.01","证券投资理论与实证分析",null,"2.0","许友传","xyc9724@yahoo.com.cn","助理研究员","70","三 11-12","JB102"]
[65,"院聘","本科生","ECON120004.01","当代西方经济学流派",null,"2.0","方钦","errantking@gmail.com","讲师","70","三 11-12","H4303"]
[66,"院聘","本科生","ECON110014.01","投资组合与家庭理财",null,"2.0","姚京","jyao.cn@gmail.com","助理研究员","70","三 11-12","H6105"]
[67,"院聘","本科生","ECON119002.01","博弈论与中国智慧",null,"2.0","钱勇","011015147@fudan.edu.cn","讲师","100","四 11-12","H4403"]
[68,"院聘","本科生","ECON110014.02","投资组合与家庭理财",null,"2.0","程向前","xq-cheng@fudan.edu.cn","高级讲师","70","四 11-12","H6105"]
[69,"院聘","本科生","ECON119001.01","用经济学智慧解读中国",null,"2.0","石磊","shilei@fudan.edu.cn","教授","100","四 6-7","H3206"]
[70,"院聘","二专","968.036.1.01","国际经济学",null,"3.0","蔡晓月","caixiaoyue@fudan.edu.cn","讲师","90","一 11-13","H4104"]
[72,"院聘","二专","968.012.1.01","人口、资源与环境经济学",null,"3.0","李志青","zhiqingli@fudan.edu.cn","讲师","110","一 11-13","H4301"]
[75,"院聘","二专","968.025.1.01","国际经营",null,"3.0","强永昌","ychqiang@fudan.edu.cn","教授","90","三 11-13","H4104"]
[79,"院聘","二专","968.023.1.01","货币经济学",null,"3.0","田素华","tiansuhua@fudan.edu.cn","教授","90","四 11-13","H4104"]